{"text_format":"1","workbook":"xlsx","n_sheets":10,"sheets":["Inleiding","Instructies","1. Algemeen beleid","2. Personeelsbeleid","3. Leiderschap","4. Interne & externe comm","Drop down","Feedback","5. Diversiteitsnetwerken","Verklarende info"],"not_rendered":{"charts":0,"images":30,"macros":1,"external_links":0,"defined_names":0,"comments":0,"pivot_tables":0},"unopened":[],"bounds":{"document_bytes":16777216,"sheet_cells":100000,"rows_first":2000,"rows_last":500,"rows_between":2000,"halvings":0,"cell_chars":16384,"cell_head_chars":4096},"cells_cut":0,"cells_raw":0,"read":"whole","date_system":"1900"}

{"sheet":"Inleiding","index":0,"n_rows":22,"n_cols":1,"rows_kept":22,"cut":false,"hidden":false,"merged":[]}
[]
[]
["This project has received funding from the European Union’s Rights, Equality and Citizenship Programme under agreement No 848519. This publication reflects the views only of the author, and neither the European Union institutions and bodies nor any person acting on their behalf may be held responsible for the use which may be made of the information contained therein."]
["Organisatiescan diversiteit en inclusie"]
["Met aandacht voor LGBTQI+-diversiteit en inclusie"]
[]
[]
["Proficiat, jullie hebben de weg gevonden naar deze organisatiescan. Dit betekent dat jullie diversiteit en inclusie een warm hart toedragen. Met deze organisatiescan proberen we jullie een eerste idee te geven waar jullie als organisatie staan in het omgaan met diversiteit en inclusie. Met deze scan maak je een foto van de huidige stand van zaken met betrekking tot diversiteit en inclusie in jullie organisatie. Tegelijkertijd wil deze scan ook enkele handvaten en tips aanbieden om werk te maken van een inclusief beleid. "]
{"$rows_left_out":15}
{"sheet":"Instructies","index":1,"n_rows":15,"n_cols":1,"rows_kept":15,"cut":false,"hidden":false,"merged":[]}
["In deze organisatiescan komen verschillende thema’s aan bod die we kunnen linken aan diversiteit en inclusie. Jullie worden door de thema’s gegidst aan de hand van vragen en stellingen (hierbij verwijzen sommige vragen specifiek naar LGBTQI+-werknemers). Op basis van het gekozen antwoord krijgen jullie onmiddellijk feedback en een aantal tips om concreet aan de slag te gaan. "]
[]
["Volgende thema’s komen aan bod in deze scan:"]
["   1. ALGEMEEN BELEID"]
["   2. PERSONEELSBELEID"]
["   3. LEIDERSCHAP"]
["   4. INTERNE EN EXTERNE COMMUNICATIE"]
["   5. DIVERSITEITSNETWERKEN"]
{"$rows_left_out":8}
{"sheet":"1. Algemeen beleid","index":2,"n_rows":21,"n_cols":6,"rows_kept":21,"cut":false,"hidden":false,"merged":[]}
["Stelling","Meer info","Antwoord","Feedback","Eigen opmerking bij deze stelling","Mogelijke acties"]
["1. Onze organisatie erkent verschillen en individuele noden van werknemers.",null,"Maak hier uw keuze",{"$f":" IF(C2='Drop down'!A1,Feedback!B1,IF(C2='Drop down'!A2,Feedback!B1, IF(C2='Drop down'!A3, \"Feedback vraag 1\")))","v":"Feedback vraag 1"}]
["2. Diversiteit en inclusie staan op de agenda in onze organisatie.",null,"Maak hier uw keuze",{"$f":" IF(C3='Drop down'!A1,Feedback!B2,IF(C3='Drop down'!A2,Feedback!B3, IF(C3='Drop down'!A3, \"Feedback vraag 2\")))","v":"Feedback vraag 2"}]
["    2.1 Diversiteit en inclusie zijn begrippen die expliciet opgenomen zijn in onze \n    missie / visie.","Klik hier voor meer informatie over missie / visie","Maak hier uw keuze",{"$f":" IF(C4='Drop down'!A$1,Feedback!B4,IF(C4='Drop down'!A$2,Feedback!B5, IF(C4='Drop down'!A$3, \"Feedback vraag 2.1\")))","v":"Feedback vraag 2.1"}]
["    2.2. Diversiteit en inclusie zijn begrippen die expliciet opgenomen zijn in ons     \n    personeelsbeleid.","Klik hier voor meer informatie over personeelsbeleid","Maak hier uw keuze",{"$f":" IF(C5='Drop down'!A$1,Feedback!B6,IF(C5='Drop down'!A$2,Feedback!B7, IF(C5='Drop down'!A$3, \"Feedback vraag 2.2\")))","v":"Feedback vraag 2.2"}]
["    2.3. Diversiteit en inclusie zijn begrippen die expliciet opgenomen zijn in ons \n    welzijnsbeleid.","Klik hier voor meer informatie over welzijnsbeleid","Maak hier uw keuze",{"$f":" IF(C6='Drop down'!A$1,Feedback!B8,IF(C6='Drop down'!A$2,Feedback!B9, IF(C6='Drop down'!A$3, \"Feedback vraag 2.3\")))","v":"Feedback vraag 2.3"}]
["    2.4. Onze organisatie heeft een diversiteitsbeleid.","Klik hier voor meer informatie over diversiteitsbeleid","Maak hier uw keuze",{"$f":" IF(C7='Drop down'!A$1,Feedback!B10,IF(C7='Drop down'!A$2,Feedback!B11, IF(C7='Drop down'!A$3, \"Feedback vraag 2.4\")))","v":"Feedback vraag 2.4"}]
["    2.5. Onze organisatie heeft oog voor de belangen van LGBTQI+-werknemers.","Klik hier voor meer info over waar LGBTQ+-werknemers voor staat","Maak hier uw keuze",{"$f":" IF(C8='Drop down'!A$1,Feedback!B12,IF(C8='Drop down'!A$2,Feedback!B13, IF(C8='Drop down'!A$3, \"Feedback vraag 2.5\")))","v":"Feedback vraag 2.5"}]
{"$rows_left_out":14}
{"sheet":"2. Personeelsbeleid","index":3,"n_rows":28,"n_cols":6,"rows_kept":28,"cut":false,"hidden":false,"merged":[[15,0,15,1],[18,0,18,1]]}
["Stelling","Meer info","Antwoord","Feedback","Eigen opmerking bij deze stelling","Mogelijke acties"]
["WERVING- EN SELECTIEPROCEDURES"]
["1. Rekruteerders zijn zich bewust van de (mogelijke) impact van stereotypes en vooroordelen bij werving en selectie, bijvoorbeeld via sensibilisering en opleiding.","Klik hier voor meer informatie over stereotypes en vooroordelen","Maak hier uw keuze",{"$f":" IF(C3='Drop down'!A1,Feedback!B38,IF(C3='Drop down'!A2,Feedback!B39, IF(C3='Drop down'!A3, \"Feedback vraag 1\")))","v":"Feedback vraag 1"}]
["2. Onze organisatie zet actief in op werving van een diverse werknemerspopulatie. Gebeurt minstens één van onderstaande stellingen binnen jullie organisatie?\n• Er worden specifieke kanalen ingezet om diverse groepen te bereiken.\n• Bij het opstellen van vacatures en functieprofielen is er oog voor diversiteit en \n    inclusie.\n• In advertenties staat expliciet vermeld dat onze organisatie diversiteit en inclusie \n    nastreeft.",null,"Maak hier uw keuze",{"$f":" IF(C4='Drop down'!A1,Feedback!B40,IF(C4='Drop down'!A2,Feedback!B41, IF(C4='Drop down'!A3, \"Feedback vraag 2\")))","v":"Feedback vraag 2"}]
["3. De vacatureteksten, het selecteren van curriculum vitae, het afnemen van interviews en de gebruikte procedures voor de selectie zijn vrij van elke vorm van discriminatie.",null,"Maak hier uw keuze",{"$f":" IF(C5='Drop down'!A1,Feedback!B42,IF(C5='Drop down'!A2,Feedback!B43, IF(C5='Drop down'!A3, \"Feedback vraag 3\")))","v":"Feedback vraag 3"}]
["    3.1. Wordt er tijdens het selectieproces aan blind screening gedaan? D.w.z. er    \n    hoeven geen naam, geboortedatum, foto of gender vermeld te worden bij job \n    aanvragen of op curriculum vitae.",null,"Maak hier uw keuze",{"$f":" IF(C6='Drop down'!A1,Feedback!B44,IF(C6='Drop down'!A2,Feedback!B45, IF(C6='Drop down'!A3, \"Feedback vraag 3.1\")))","v":"Feedback vraag 3.1"}]
["    3.2. Het selectiepanel is divers samengesteld.",null,"Maak hier uw keuze",{"$f":" IF(C7='Drop down'!A1,Feedback!B46,IF(C7='Drop down'!A2,Feedback!B47, IF(C7='Drop down'!A3, \"Feedback vraag 3.2\")))","v":"Feedback vraag 3.2"}]
["    3.3. Bij gelijke competentie wordt voorrang gegeven aan de kandidaat uit een \n    minderheidsgroep.",null,"Maak hier uw keuze",{"$f":" IF(C8='Drop down'!A1,Feedback!B48,IF(C8='Drop down'!A2,Feedback!B49, IF(C8='Drop down'!A3, \"Feedback vraag 3.3\")))","v":"Feedback vraag 3.3"}]
{"$rows_left_out":21}
{"sheet":"3. Leiderschap","index":4,"n_rows":14,"n_cols":6,"rows_kept":14,"cut":false,"hidden":false,"merged":[]}
["Stelling","Meer info","Antwoord","Feedback","Eigen opmerking bij deze stelling","Mogelijke acties"]
["Kent jullie organisatie verschillende hiërarchische niveaus?",null,"Maak hier uw keuze"]
[]
["1. Het topmanagement / de algemene directie draagt een duidelijke visie uit rond diversiteit en inclusie.\nMinstens één van volgende stellingen geldt voor onze organisatie:\n• Het topmanagement is zelf divers samengesteld.\n• Diversiteit en inclusie worden op management niveau besproken.\n• Diversiteit en inclusie komen terug in de communicatie van het topmanagement \n    met de werknemers.\n• Diversiteit en inclusie worden opgenomen in doelen (bv. in JAP, begroting, …).\n• Diversiteit en inclusie worden besproken tijdens functionerings- en \n    evaluatiegesprekken.\n• Er worden opleidingen / lezingen / sensibilisatie georganiseerd.\n• Er wordt op spontane wijze wel eens open dialoog gevoerd over diversiteit en \n    inclusie. \n• Leidinggevenden kunnen bij het topmanagement terecht met vragen omtrent \n    diversiteit en inclusie.\n• Er is een werkgroep en/of verantwoordelijke voor diversiteit en inclusie.\n• Andere, namelijk ...","Klik hier voor meer informatie over jaaractieplan (JAP)","Maak hier uw keuze",{"$f":" IF(C4='Drop down'!A1,Feedback!B82,IF(C4='Drop down'!A2,Feedback!B83, IF(C4='Drop down'!A3, \"Feedback vraag 1\")))","v":"Feedback vraag 1"}]
["2. Er is duidelijke communicatie rond het diversteits- en inclusiebeleid.\nDeze communicatie is opgenomen / gebeurt minstens via één van volgende kanalen:\n• In het argbeidsreglement\n• In de gedragscode\n• Via mail\n• Via de nieuwsbrief\n• Via posters\n• Via face-to-face gesprekken\n• Via videoboodschappen\n• Via andere kanalen",null,"Maak hier uw keuze",{"$f":" IF(C5='Drop down'!A1,Feedback!B84,IF(C5='Drop down'!A2,Feedback!B85, IF(C5='Drop down'!A3, \"Feedback vraag 2\")))","v":"Feedback vraag 2"}]
["3. Vanuit het topmanagement / de algemene directie vertrekken initiatieven om direct leidinggevenden de nodige competenties te bieden en om hen voldoende op te leiden in verband met het diversiteits- en inclusiebeleid.\nMinstens één van volgende stellingen geldt voor jullie organisatie:\n• De organisatie heeft een plan voorbereid voor het ontwikkelen van competenties  \n    rond diversiteit en inclusie.\n• Bij de aanwerving van leidinggevenden worden competenties rond diversiteit en \n    inclusie bevraagd.\n• Er worden opleidingen op maat georganiseerd voor direct leidinggevenden in \n    verband met diversiteit en inclusie.\n• Diversiteit en inclusie worden opgenomen in evaluatie- en \n    functioneringsgesprekken van leidinggevenden.",null,"Maak hier uw keuze",{"$f":" IF(C6='Drop down'!A1,Feedback!B86,IF(C6='Drop down'!A2,Feedback!B87, IF(C6='Drop down'!A3, \"Feedback vraag 3\")))","v":"Feedback vraag 3"}]
["4. Het topmanagement / de algemene directie streeft naar voldoende diversiteit in de hiërarchische lijn.",null,"Maak hier uw keuze",{"$f":" IF(C7='Drop down'!A1,Feedback!B88,IF(C7='Drop down'!A2,Feedback!B89, IF(C7='Drop down'!A3, \"Feedback vraag 4\")))","v":"Feedback vraag 4"}]
["5. Onze direct leidinggevenden dragen een duidelijke visie uit rond diversiteit en inclusie naar hun teams.\nMinstens één van volgende stellingen geldt voor onze organisatie:\n• De groep van direct leidinggevenden is zelf divers samengesteld. \n• Diversiteit en inclusie worden op leidinggevend niveau besproken.\n• Diversiteit en inclusie komen terug in de communicatie van het directe \n    leidinggevenden met de werknemers.\n• Diversiteit en inclusie worden opgenomen in doelen (bv. op teamniveau).\n• Diversiteit en inclusie worden besproken tijdens functionerings- en \n    evaluatiegesprekken.\n• Er worden opleidingen / lezingen / sensibilisatie georganiseerd.\n• Er wordt op spontane wijze wel eens open dialoog gevoerd over diversiteit en \n    inclusie. \n• Werknemers kunnen bij de direct leidinggevenden terecht met vragen omtrent \n    diversiteit en inclusie.\n• Er is een werkgroep en/of verantwoordelijke voor diversiteit en inclusie.\n• Andere, namelijk ...","Klik hier voor meer informatie over jaaractieplan (JAP)","Maak hier uw keuze",{"$f":" IF(C8='Drop down'!A1,Feedback!B90,IF(C8='Drop down'!A2,Feedback!B91, IF(C8='Drop down'!A3, \"Feedback vraag 5\")))","v":"Feedback vraag 5"}]
{"$rows_left_out":7}
{"sheet":"4. Interne & externe comm","index":5,"n_rows":6,"n_cols":6,"rows_kept":6,"cut":false,"hidden":false,"merged":[]}
["Stelling","Meer info","Antwoord","Feedback","Eigen opmerking bij deze stelling","Mogelijke acties"]
["INTERNE COMMUNICATIE"]
["1. Onze interne communicatie houdt rekening met de diversiteit van werknemers en partners.\nMinstens één van volgende stellingen geldt voor onze organisatie:\n• We gebruiken inclusieve terminologie (bv. genderneutrale terminologie)\n• Het gebruikte beeldmateriaal (bv. foto's op website) weerspiegelt de diversiteit \n    binnen de organisatie en/of de samenleving\n•Iedere werknemer ontvangt heldere en volledige informatie. Er worden geen \n   werknemers buitengesloten van bepaalde interne communicatie op basis van \n   huidskleur, fysieke toestand, fysieke beperkingen, karakter, seksuele oriëntatie en \n   genderidentiteit en - expressie (LGBTQI+), gevolgde opleidingen en vaardigheden, \n   geloofsovertuiging, …",null,"Maak hier uw keuze",{"$f":" IF(C3='Drop down'!A1,Feedback!B104,IF(C3='Drop down'!A2,Feedback!B105, IF(C3='Drop down'!A3, \"Feedback vraag 1\")))","v":"Feedback vraag 1"}]
["2. Informatie over hoe onze organisatie omgaat met diversiteit en inclusie is toegankelijk voor onze werknemers.\nMinstens één van volgende stellingen geldt voor onze organisatie:\n• De info is gemakkelijk terug te vinden (bv. op het intranet, de website, ...)\n• De info wordt actief verspreid naar werknemers (bv. via e-mail, nieuwsbrieven, ...)\n• De info wordt op een andere manier toegankelijk gesteld voor werknemers",null,"Maak hier uw keuze",{"$f":" IF(C4='Drop down'!A1,Feedback!B106,IF(C4='Drop down'!A2,Feedback!B107, IF(C4='Drop down'!A3, \"Feedback vraag 2\")))","v":"Feedback vraag 2"}]
["EXTERNE COMMUNICATIE"]
["3. In onze externe communicatie dragen we onze visie rond diversiteit en inclusie uit.\nDit komt minstens op één van volgende manieren aan bod:\n• Diversiteit en inclusie maken integraal deel uit van onze communicatie en \n    beeldvorming naar externen (bv. website, social media, ...).\n• We promoten onze (interne) initiatieven rond diversiteit en inclusie (bv. delen op \n    social media).\n• We nemen deel aan externe initiatieven omtrent diversiteit (bv. onderzoek, \n    vrijwilligerswerk, praatgroepen, evenementen, themadagen, ...).\n• We ondertekenden een diversiteitscharter.\n• We zijn een grote organisatie en hebben in de communicatie naar andere filialen \n    ook aandacht voor diversiteit en inclusie.\n• We adverteren bewust via bepaalde kanalen om ook minderheidsgroepen te \n    bereiken.","Klik hier voor meer informatie over diversiteitscharter","Maak hier uw keuze",{"$f":" IF(C6='Drop down'!A1,Feedback!B108,IF(C6='Drop down'!A2,Feedback!B109, IF(C6='Drop down'!A3, \"Feedback vraag 3\")))","v":"Feedback vraag 3"}]

{"sheet":"Drop down","index":6,"n_rows":3,"n_cols":1,"rows_kept":3,"cut":false,"hidden":true,"merged":[]}
["JA"]
["NEE"]
["Maak hier uw keuze"]

{"sheet":"Feedback","index":7,"n_rows":119,"n_cols":3,"rows_kept":119,"cut":false,"hidden":true,"merged":[]}
["Algemeen beleid - FB Vraag 1 - Antwoord JA of NEE","• Iedereen is anders, ook op de werkvloer. Laat je tijdens deze organisatiescan niet enkel leiden \n    door zichtbare verschillen tussen werknemers. Veel verschillen zijn ook onzichtbaar.\n• Een organisatie die oog heeft voor ieders ‘anders zijn’ kan de gezondheid en veiligheid van haar \n    werknemers beter bewaken. \n• Een one-size-fits-all beleid gaat niet hand in hand met diversiteit en inclusie. Van een organisatie \n    wordt verwacht te investeren in elk individu, met oog voor individuele noden en behoeften.\n• Werknemers die zich gewaardeerd voelen, ervaren meer welzijn op het werk. Dit houdt o.a. in: meer \n    bevlogenheid, en minder stress, burn-out, verzuim en verloop. Zowel werknemers als werkgevers \n    halen dus voordeel uit de investering in een diverse en inclusieve cultuur."]
["b","😀 Goed bezig! \n• Door diversiteit en inclusie met regelmaat op de agenda te zetten, kan het thema geleidelijk aan   \n    aandacht en draagvlak winnen.\n• Bewustwording is echter niet voldoende. Diversiteit en inclusie moeten verankerd worden in hoe \n    werk georganiseerd wordt. Elke organisatie kan hierin een bijdrage leveren, zodat we samen \n    kunnen streven naar een inclusieve maatschappij."]
["Algemeen beleid - FB Vraag 2 - Antwoord NEE","Dat kan beter 💪!\n• Door deze organisatiescan te doorlopen zet jullie organisatie een goede stap richting \n    bewustwording van diversiteit en inclusie.\n• Bewustwording is echter niet voldoende. Diversiteit en inclusie moeten verankerd worden in hoe \n    werk georganiseerd wordt. Elke organisatie kan hierin een bijdrage leveren, zodat we samen \n    kunnen streven naar een inclusieve maatschappij.\n• Door diversiteit en inclusie met regelmaat op de agenda te zetten, kan het thema geleidelijk aan \n    aandacht en draagvlak winnen. "]
["Algemeen beleid - FB Vraag 2.1 - Antwoord JA","😀 Goed bezig! \n• Diversiteit en inclusie opnemen in jullie missie / visie is een perfect vertrekpunt om jullie organisatie \n    inclusief te maken.\n• De missie / visie van jullie organisatie weerspiegelt waar deze voor staat. Dit getuigt van \n    engagement, wat een noodzaak is om een inclusieve organisatie te kunnen zijn."]
["Algemeen beleid - FB Vraag 2.1 - Antwoord NEE","Dat kan beter 💪!\n• Engagement is een eerste noodzakelijke stap om diversiteit en inclusie in jullie organisatie te \n    verankeren. \n• Door diversiteit en inclusie in de missie / visie op te nemen communiceren jullie duidelijk dat dit tot \n    de kern van jullie organisatie behoort. Het getuigt van oprechtheid en motivatie.\n• Door diversiteit en inclusie in de missie / visie op te nemen, krijg je meteen een zicht op hoe \n    diversiteit en inclusie kunnen kaderen in het groter geheel. Ze sluiten bijvoorbeeld aan bij andere \n    kernwaarden waar reeds een draagvlak voor bestaat en waaraan acties gekoppeld zijn.\n• Neem diversiteit en inclusie stap voor stap op in de missie / visie. Zo geven jullie de \n    organisatiecultuur tijd om mee te veranderen. Een draagvlak creëren voor kernwaarden is \n    essentieel. Zo vermindert de weerstand waarop jullie kunnen botsen. \n• Toets af welke ideeën er leven over diversiteit en inclusie bij verschillende werknemers. Zo kunnen\n     zij ook hun stem laten horen.\n• Niemand hoeft het warm water uit te vinden. Breng in kaart wat jullie organisatie al doet rond \n    diversiteit en inclusie. Stel dit kritisch in vraag: wat loopt goed? Wat loopt minder goed? Waar zit \n    groeipotentieel? Vertrek van daaruit naar een actieplan. "]
["Algemeen beleid - FB Vraag 2.2 - Antwoord JA","😀 Goed bezig! \nOm een missie / visie te implementeren in een organisatie moeten er concrete procedures aan vasthangen. Een personeelsbeleid dat expliciet rekening houdt met diversiteit en inclusie is daar een goed voorbeeld van."]
["Algemeen beleid - FB Vraag 2.2 - Antwoord NEE","Dat kan beter 💪!\n• Het personeelsbeleid herbekijken is een haalbaar en goed vertrekpunt om diversiteit en inclusie te \n    implementeren in jullie organisatie. \n• Door concrete procedures te koppelen aan de missie / visie rond diversiteit en inclusie, zal het \n    thema tot leven komen binnen jullie organisatie.\n• Een werkgroep kan hierbij helpen. Mogelijke leden van zo’n werkgroep zijn HR-experten, \n    vertrouwenspersonen, interne (of externe) preventieadviseurs, werknemers die de diversiteit in de \n    organisatie vertegenwoordigen, …"]
["Algemeen beleid - FB Vraag 2.3 - Antwoord JA","😀 Goed bezig! \n• Om een missie / visie te implementeren in een organisatie moeten er concrete procedures aan vast \n    hangen. Diversiteit en inclusie expliciet in het welzijnsbeleid opnemen is daar een goed voorbeeld \n    van.\n• Iedere werknemer heeft het recht om zich goed te voelen op het werk. Door in te zetten op \n    diversiteit en inclusie in je welzijnsbeleid bouw je mee aan een verhoogd welzijn bij je werknemers.\n• Werken aan welzijn op het werk is ook een wettelijke verplichting. De wet van 4 augustus 1996 \n    betreffende het welzijn op het werk is de basiswet op het vlak van de veiligheid en de gezondheid \n    op het werk en verplicht organisaties om het thema hoog in het vaandel te dragen."]
{"$rows_left_out":112}
{"sheet":"5. Diversiteitsnetwerken","index":8,"n_rows":7,"n_cols":6,"rows_kept":7,"cut":false,"hidden":false,"merged":[]}
["\nKlik hier voor meer informatie over diversiteitsnetwerken\n"]
["Stelling","Meer info","Antwoord","Feedback","Eigen opmerking bij deze stelling","Mogelijke acties"]
["1. In onze organisatie is er openheid ten aanzien van diversiteitsnetwerken.\nMinstens één van volgende stellingen geldt voor onze organisatie:\n• Ja, als werknemers zelf een voorstel doen, mogen ze dit uitwerken\n• Ja, als organisatie nemen we hier zelf initiatief in",null,"Maak hier uw keuze",{"$f":" IF(C3='Drop down'!A1,Feedback!B110,IF(C3='Drop down'!A2,Feedback!B111, IF(C3='Drop down'!A3, \"Feedback vraag 1\")))","v":"Feedback vraag 1"}]
["2. Onze organisatie investeert actief in een vorm van diversiteitsnetwerken (vraag voor grote organisaties).\nOF Onze medewerkers worden aangemoedigd om zich aan te sluiten bij externe diversiteitsnetwerken (vraag voor kleine organisaties).",null,"Maak hier uw keuze",{"$f":" IF(C4='Drop down'!A1,Feedback!B112,IF(C4='Drop down'!A2,Feedback!B113, IF(C4='Drop down'!A3, \"Feedback vraag 2\")))","v":"Feedback vraag 2"}]
["    2.1. Deze investering komt tot uiting op minstens één van volgende manieren:\n    • Financieel / sponsoring\n    • Logistiek / praktisch\n    • Tijd vrij maken / mandaat vanuit de directie of het management\n    • Structureel ingebed vs. periodiek / ad hoc initiatieven ",null,"Maak hier uw keuze",{"$f":" IF(C5='Drop down'!A1,Feedback!B114,IF(C5='Drop down'!A2,Feedback!B115, IF(C5='Drop down'!A3, \"Feedback vraag 2.1\")))","v":"Feedback vraag 2.1"}]
["    2.2. Diversiteitsnetwerken hebben minstens één van volgende rollen:\n    • Sociale ontmoeting\n    • Support group\n    • Mentoring\n    • Organisatie van activiteiten binnen het bedrijf (bv. open deur, lezing)\n    • Deelname aan externe activiteiten (bv. gay pride parade)\n    • Adviserende rol voor diversiteits- en inclusiebeleid\n    • Sensibilisering naar werknemers\n    • Actieve deelname aan externe communicatie",null,"Maak hier uw keuze",{"$f":" IF(C6='Drop down'!A1,Feedback!B116,IF(C6='Drop down'!A2,Feedback!B117, IF(C6='Drop down'!A3, \"Feedback vraag 2.2\")))","v":"Feedback vraag 2.2"}]
["3. Er bestaat een samenwerking tussen onze organisatie en andere organisaties / belangengroepen in verband met diversiteit.\nMinstens één van volgende stellingen geldt voor onze organisatie:\n• We maken deel uit van een overkoepelend forum dat specifiek samenkomt rond   \n    het thema diversiteit en inclusiviteit (bv. onder HR-experten, directies, \n    overkoepelende werkgroep met werknemers, met belangengroepen, ...)\n• Het is een regelmatig terugkerend agendapunt in overkoepelend forum dat\n    meerdere thema’s behartigt",null,"Maak hier uw keuze",{"$f":" IF(C7='Drop down'!A1,Feedback!B118,IF(C7='Drop down'!A2,Feedback!B119, IF(C7='Drop down'!A3, \"Feedback vraag 3\")))","v":"Feedback vraag 3"}]

{"sheet":"Verklarende info","index":9,"n_rows":21,"n_cols":3,"rows_kept":21,"cut":false,"hidden":false,"merged":[]}
[null,"Verklarende woordenschat","Meer info"]
["Missie / visie","De missie beschrijft de kernopdracht van de organisatie. De visie beschrijft de kernwaarden van de organisatie. \n","https://beleidsplanning.socius.be/2-1-het-belang-van-je-missie-visie/"]
["Personeelsbeleid","HR beleid of personeelsbeleid kan gezien worden als het geheel aan maatregelen en instrumenten gericht op de werkzame personen binnen een organisatie met als doel het verwezenlijken van de organisatiedoelstellingen. \n","https://www.ubsbusiness.nl/kennisbank/hr-beleid/"]
["Welzijnsbeleid","Werken aan welzijn op het werk is in eerste instantie een wettelijke verplichting. De wet van 4 augustus 1996 betreffende het welzijn op het werk (gebaseerd op Europese kaderrichtlijn 89/391/EEG en getransponeerd naar Belgische context) is de basiswet op het vlak van de veiligheid en de gezondheid op het werk en verplicht organisaties om het thema hoog in het vaandel te dragen. Ze voorziet een wettelijke basis voor initiatieven op het vlak van het welzijn op het werk inzake: arbeidsveiligheid, gezondheid, psychosociale belasting, ergonomie, arbeidshygiëne, verfraaiing van de arbeidsplaats, leefmilieu. Deze initiatieven kunnen worden vastgelegd in de vorm van een welzijnsbeleid. ","https://werk.belgie.be/nl/themas/welzijn-op-het-werk"]
["Diversiteitsbeleid","Diversiteitsbeleid (soms ook gebruikt als synoniem voor diversiteitsmanagement) wordt onder meer gedefinieerd als beleid dat gericht is op het erkennen en waarderen van verschillen tussen personen. \n","http://www.multicultureelopleiden.nl/school/diversiteitsbeleid/definitie/"]
["LGBTQI+","LGBTQI+ is een letterwoord om seksuele, gender- en geslachtsdiversiteit aan te duiden. L= lesbisch, G= gay (homo), B= biseksueel, T= transgender, Q = Queer, I= intersekse. De plus staat voor alle personen en groepen die buiten de gender- en heteronorm vallen, maar niet onder 1 van de genoemde letters. ","https://cavaria.be/woordenlijst"]
["Jaaractieplan","In het jaaractieplan leggen bedrijven hun preventieve acties voor het komende jaar vast.","https://werk.belgie.be/nl/themas/welzijn-op-het-werk/algemene-beginselen/algemene-principes-betreffende-het-welzijnsbeleid#toc_heading_4"]
["Globaal preventieplan","Het globaal preventieplan bevat de grote lijnen van het preventiebeleid voor een termijn van 5 jaar.","https://werk.belgie.be/nl/themas/welzijn-op-het-werk/algemene-beginselen/algemene-principes-betreffende-het-welzijnsbeleid#toc_heading_4"]
{"$rows_left_out":13}